Reaction Details
TargetDual specificity protein kinase CLK1
LigandBDBM50347755
Substrate/Competitorn/a
Meas. Tech.ChEMBL_756288 (CHEMBL1805101)
IC50 170±n/a nM
Citation Debdab, MCarreaux, FRenault, SSoundararajan, MFedorov, OFilippakopoulos, PLozach, OBabault, LTahtouh, TBaratte, BOgawa, YHagiwara, MEisenreich, ARauch, UKnapp, SMeijer, LBazureau, JP Leucettines, a class of potent inhibitors of cdc2-like kinases and dual specificity, tyrosine phosphorylation regulated kinases derived from the marine sponge leucettamine B: modulation of alternative pre-RNA splicing. J Med Chem54:4172-86 (2011) 
 
Dual specificity protein kinase CLK1
Name:Dual specificity protein kinase CLK1
Type:PROTEIN
Mol. Mass.:57124.52
Organism:Mus musculus
Description:ChEMBL_1502245
Residue:483
BDBM50347755
NameBDBM50347755
Synonyms:CHEMBL1802842
TypeSmall organic molecule
Emp. Form.C14H15N3O3
Mol. Mass.273.2872
SMILESCCNC1=NC(=Cc2ccc3OCOc3c2)C(=O)N1C