Reaction Details
TargetDual specificity protein kinase CLK3
LigandBDBM50347764
Substrate/Competitorn/a
Meas. Tech.ChEMBL_756289 (CHEMBL1805102)
IC50 960±n/a nM
Citation Debdab, MCarreaux, FRenault, SSoundararajan, MFedorov, OFilippakopoulos, PLozach, OBabault, LTahtouh, TBaratte, BOgawa, YHagiwara, MEisenreich, ARauch, UKnapp, SMeijer, LBazureau, JP Leucettines, a class of potent inhibitors of cdc2-like kinases and dual specificity, tyrosine phosphorylation regulated kinases derived from the marine sponge leucettamine B: modulation of alternative pre-RNA splicing. J Med Chem54:4172-86 (2011) 
 
Dual specificity protein kinase CLK3
Name:Dual specificity protein kinase CLK3
Type:PROTEIN
Mol. Mass.:73855.32
Organism:Mus musculus
Description:ChEMBL_1502247
Residue:638
BDBM50347764
NameBDBM50347764
Synonyms:CHEMBL1802847
TypeSmall organic molecule
Emp. Form.C17H21N3O3
Mol. Mass.315.3669
SMILESCC(C)CCNC1=NC(=Cc2ccc3OCOc3c2)C(=O)N1C