Reaction Details
TargetSerine/threonine-protein kinase pim-1
LigandBDBM50347756
Substrate/Competitorn/a
Meas. Tech.ChEMBL_756293 (CHEMBL1805106)
IC50 4500±n/a nM
Citation Debdab, MCarreaux, FRenault, SSoundararajan, MFedorov, OFilippakopoulos, PLozach, OBabault, LTahtouh, TBaratte, BOgawa, YHagiwara, MEisenreich, ARauch, UKnapp, SMeijer, LBazureau, JP Leucettines, a class of potent inhibitors of cdc2-like kinases and dual specificity, tyrosine phosphorylation regulated kinases derived from the marine sponge leucettamine B: modulation of alternative pre-RNA splicing. J Med Chem54:4172-86 (2011) 
 
Serine/threonine-protein kinase pim-1
Name:Serine/threonine-protein kinase pim-1
Type:Protein
Mol. Mass.:35681.82
Organism:Homo sapiens (Human)
Description:P11309
Residue:313
BDBM50347756
NameBDBM50347756
Synonyms:CHEMBL1802843
TypeSmall organic molecule
Emp. Form.C15H17N3O3
Mol. Mass.287.3138
SMILESCCCNC1=NC(=Cc2ccc3OCOc3c2)C(=O)N1C