Reaction Details
TargetAdenosine receptor A2a
LigandBDBM50315603
Substrate/Competitorn/a
Meas. Tech.ChEMBL_756376 (CHEMBL1805402)
Ki 18±n/a nM
Citation Congreve, MLangmead, CJMason, JSMarshall, FH Progress in structure based drug design for G protein-coupled receptors. J Med Chem54:4283-311 (2011) 
 
Adenosine receptor A2a
Name:Adenosine receptor A2a
Type:G Protein-Coupled Receptor (GPCR)
Mol. Mass.:44716.46
Organism:Homo sapiens (Human)
Description:P29274
Residue:412
BDBM50315603
NameBDBM50315603
Synonyms:2-(furan-2-yl)-5-phenoxy-[1,2,4]triazolo[1,5-a][1,3,5]triazin-7-amine | CHEMBL1093313
TypeSmall organic molecule
Emp. Form.C14H10N6O2
Mol. Mass.294.2682
SMILESNc1nc(Oc2ccccc2)nc2nc(nn12)-c1ccco1