Reaction Details
TargetB1 bradykinin receptor
LigandBDBM50184183
Substrate/Competitorn/a
Meas. Tech.ChEMBL_756380 (CHEMBL1805406)
Ki 0.045000±n/a nM
Citation Congreve, MLangmead, CJMason, JSMarshall, FH Progress in structure based drug design for G protein-coupled receptors. J Med Chem54:4283-311 (2011) 
 
B1 bradykinin receptor
Name:B1 bradykinin receptor
Type:Enzyme
Mol. Mass.:40508.87
Organism:Homo sapiens (Human)
Description:P46663
Residue:353
BDBM50184183
NameBDBM50184183
Synonyms:3,3'-difluoro-4'-{[5-(4-pyridin-4-yl-piperazine-1-carbonyl)-pyridin-2-ylamino]-methyl}-biphenyl-2-carboxylic acid methyl ester | CHEMBL425588
TypeSmall organic molecule
Emp. Form.C30H27F2N5O3
Mol. Mass.543.5639
SMILESCOC(=O)c1c(F)cccc1-c1ccc(CNc2ccc(cn2)C(=O)N2CCN(CC2)c2ccncc2)c(F)c1