Reaction Details
TargetSerine/threonine-protein kinase Nek2
LigandBDBM50347866
Substrate/Competitorn/a
Meas. Tech.ChEMBL_756564 (CHEMBL1804637)
IC50 130±n/a nM
Citation Henise, JCTaunton, J Irreversible Nek2 kinase inhibitors with cellular activity. J Med Chem54:4133-46 (2011) 
 
Serine/threonine-protein kinase Nek2
Name:Serine/threonine-protein kinase Nek2
Type:Enzyme
Mol. Mass.:51776.96
Organism:Homo sapiens (Human)
Description:P51955
Residue:445
BDBM50347866
NameBDBM50347866
Synonyms:CHEMBL1802384
TypeSmall organic molecule
Emp. Form.C17H16ClN3O2
Mol. Mass.329.781
SMILESCCc1nc(C)c(C=C2C(=O)Nc3ccc(cc23)C(=O)CCl)[nH]1