Reaction Details
TargetSerine/threonine-protein kinase Nek2
LigandBDBM50347869
Substrate/Competitorn/a
Meas. Tech.ChEMBL_756564 (CHEMBL1804637)
IC50 620±n/a nM
Citation Henise, JCTaunton, J Irreversible Nek2 kinase inhibitors with cellular activity. J Med Chem54:4133-46 (2011) 
 
Serine/threonine-protein kinase Nek2
Name:Serine/threonine-protein kinase Nek2
Type:Enzyme
Mol. Mass.:51776.96
Organism:Homo sapiens (Human)
Description:P51955
Residue:445
BDBM50347869
NameBDBM50347869
Synonyms:CHEMBL1802388
TypeSmall organic molecule
Emp. Form.C15H10N4O2
Mol. Mass.278.2655
SMILESO=C(Nc1ccc2NC(=O)C(=Cc3cnc[nH]3)c2c1)C#C