Reaction Details
TargetInterferon-induced, double-stranded RNA-activated protein kinase
LigandBDBM50347879
Substrate/Competitorn/a
Meas. Tech.ChEMBL_756675 (CHEMBL1805140)
IC50 7000±n/a nM
Citation Bryk, RWu, KRaimundo, BCBoardman, PEChao, PConn, GLAnderson, ECole, JLDuffy, NPNathan, CGriffin, JH Identification of new inhibitors of protein kinase R guided by statistical modeling. Bioorg Med Chem Lett21:4108-14 (2011) 
 
Interferon-induced, double-stranded RNA-activated protein kinase
Name:Interferon-induced, double-stranded RNA-activated protein kinase
Type:PROTEIN
Mol. Mass.:62104.61
Organism:Homo sapiens (Human)
Description:ChEMBL_1467743
Residue:551
BDBM50347879
NameBDBM50347879
Synonyms:CHEMBL1802779
TypeSmall organic molecule
Emp. Form.C24H17FN4
Mol. Mass.380.417
SMILESFc1ccc(Nc2nccc(n2)-c2c([nH]c3ccccc23)-c2ccccc2)cc1