Reaction Details
TargetInterferon-induced, double-stranded RNA-activated protein kinase
LigandBDBM50347885
Substrate/Competitorn/a
Meas. Tech.ChEMBL_756675 (CHEMBL1805140)
IC50 2500±n/a nM
Citation Bryk, RWu, KRaimundo, BCBoardman, PEChao, PConn, GLAnderson, ECole, JLDuffy, NPNathan, CGriffin, JH Identification of new inhibitors of protein kinase R guided by statistical modeling. Bioorg Med Chem Lett21:4108-14 (2011) 
 
Interferon-induced, double-stranded RNA-activated protein kinase
Name:Interferon-induced, double-stranded RNA-activated protein kinase
Type:PROTEIN
Mol. Mass.:62104.61
Organism:Homo sapiens (Human)
Description:ChEMBL_1467743
Residue:551
BDBM50347885
NameBDBM50347885
Synonyms:CHEMBL1802773
TypeSmall organic molecule
Emp. Form.C19H14Cl2N4
Mol. Mass.369.247
SMILESCc1[nH]c2ccc(Cl)cc2c1-c1ccnc(Nc2cccc(Cl)c2)n1