Reaction Details
TargetPotassium voltage-gated channel subfamily H member 2
LigandBDBM50347947
Substrate/Competitorn/a
Meas. Tech.ChEMBL_755804 (CHEMBL1803471)
IC50 5600±n/a nM
Citation Wu, TNagle, AKuhen, KGagaring, KBorboa, RFrancek, CChen, ZPlouffe, DGoh, ALakshminarayana, SBWu, JAng, HQZeng, PKang, MLTan, WTan, MYe, NLin, XCaldwell, CEk, JSkolnik, SLiu, FWang, JChang, JLi, CHollenbeck, TTuntland, TIsbell, JFischli, CBrun, RRottmann, MDartois, VKeller, TDiagana, TWinzeler, EGlynne, RTully, DCChatterjee, AK Imidazolopiperazines: hit to lead optimization of new antimalarial agents. J Med Chem54:5116-30 (2011) 
 
Potassium voltage-gated channel subfamily H member 2
Name:Potassium voltage-gated channel subfamily H member 2
Type:Multi-pass membrane protein
Mol. Mass.:126672.65
Organism:Homo sapiens (Human)
Description:Q12809
Residue:1159
BDBM50347947
NameBDBM50347947
Synonyms:CHEMBL1800776
TypeSmall organic molecule
Emp. Form.C22H22ClF2N5O
Mol. Mass.445.893
SMILESCC(C)(N)C(=O)N1CCn2c(C1)nc(c2Nc1ccc(Cl)c(F)c1)-c1ccc(F)cc1