Reaction Details
TargetCytochrome P450 2C19
LigandBDBM50347945
Substrate/Competitorn/a
Meas. Tech.ChEMBL_755918 (CHEMBL1803727)
IC50>8900±n/a nM
Citation Wu, TNagle, AKuhen, KGagaring, KBorboa, RFrancek, CChen, ZPlouffe, DGoh, ALakshminarayana, SBWu, JAng, HQZeng, PKang, MLTan, WTan, MYe, NLin, XCaldwell, CEk, JSkolnik, SLiu, FWang, JChang, JLi, CHollenbeck, TTuntland, TIsbell, JFischli, CBrun, RRottmann, MDartois, VKeller, TDiagana, TWinzeler, EGlynne, RTully, DCChatterjee, AK Imidazolopiperazines: hit to lead optimization of new antimalarial agents. J Med Chem54:5116-30 (2011) 
 
Cytochrome P450 2C19
Name:Cytochrome P450 2C19
Type:Enzyme
Mol. Mass.:55935.47
Organism:Homo sapiens (Human)
Description:P33261
Residue:490
BDBM50347945
NameBDBM50347945
Synonyms:CHEMBL1800774
TypeSmall organic molecule
Emp. Form.C22H22F3N5O
Mol. Mass.429.4382
SMILESCC(C)(N)C(=O)N1CCn2c(C1)nc(c2Nc1ccc(F)c(F)c1)-c1ccc(F)cc1