Reaction Details
TargetProtein-S-isoprenylcysteine O-methyltransferase
LigandBDBM50348004
Substrate/Competitorn/a
Meas. Tech.ChEMBL_757250 (CHEMBL1803626)
IC50 120±n/a nM
Citation Judd, WRSlattum, PMHoang, KCBhoite, LValppu, LAlberts, GBrown, BRoth, BOstanin, KHuang, LWettstein, DRichards, BWillardsen, JA Discovery and SAR of methylated tetrahydropyranyl derivatives as inhibitors of isoprenylcysteine carboxyl methyltransferase (ICMT). J Med Chem54:5031-47 (2011) 
 
Protein-S-isoprenylcysteine O-methyltransferase
Name:Protein-S-isoprenylcysteine O-methyltransferase
Type:PROTEIN
Mol. Mass.:31943.26
Organism:Homo sapiens (Human)
Description:ChEMBL_956034
Residue:284
BDBM50348004
NameBDBM50348004
Synonyms:CHEMBL1484316
TypeSmall organic molecule
Emp. Form.C27H31NO3
Mol. Mass.417.5399
SMILESCC1(C)CC(CCN(Cc2ccccc2)C(=O)c2ccco2)(CCO1)c1ccccc1