Reaction Details
TargetCarbonic anhydrase 6
LigandBDBM50031472
Substrate/Competitorn/a
Meas. Tech.ChEMBL_757507 (CHEMBL1804479)
Ki 520±n/a nM
Citation Oztürk Sarikaya, SBTopal, FSentürk, MGülçin, ISupuran, CT In vitro inhibition ofa-carbonic anhydrase isozymes by some phenolic compounds. Bioorg Med Chem Lett21:4259-62 (2011) 
 
Carbonic anhydrase 6
Name:Carbonic anhydrase 6
Type:Enzyme
Mol. Mass.:35371.40
Organism:Homo sapiens (Human)
Description:P23280
Residue:308
BDBM50031472
NameBDBM50031472
Synonyms:1,2,3-Trihydroxybenzene, XIV Pyrogallol (10) pyrogallol
TypeSmall organic molecule
Emp. Form.C6H6O3
Mol. Mass.126.11
SMILESOc1cccc(O)c1O