Reaction Details
TargetCarbonic anhydrase
LigandBDBM26190
Substrate/Competitorn/a
Meas. Tech.ChEMBL_757508 (CHEMBL1804480)
Ki 5930±n/a nM
Citation Oztürk Sarikaya, SBTopal, FSentürk, MGülçin, ISupuran, CT In vitro inhibition ofa-carbonic anhydrase isozymes by some phenolic compounds. Bioorg Med Chem Lett21:4259-62 (2011) 
 
Carbonic anhydrase
Name:Carbonic anhydrase
Synonyms:n/a
Type:PROTEIN
Mol. Mass.:32973.15
Organism:Dicentrarchus labrax
Description:ChEMBL_757508
Residue:309
BDBM26190
NameBDBM26190
TypeSmall organic molecule
Emp. Form.C6H6O2
Mol. Mass.110.1106
SMILESOc1ccc(O)cc1