Reaction Details
TargetCannabinoid receptor 1
LigandBDBM50348122
Substrate/Competitorn/a
Meas. Tech.ChEMBL_757136 (CHEMBL1803276)
Ki>20000±n/a nM
Citation Watson, COwen, DRHarding, DKon-I, KLewis, MLMason, HJMatsumizu, MMukaiyama, TRodriguez-Lens, MShima, ATakeuchi, MTran, IYoung, T Optimisation of a novel series of selective CNS penetrant CB(2) agonists. Bioorg Med Chem Lett21:4284-7 (2011) 
 
Cannabinoid receptor 1
Name:Cannabinoid receptor 1
Type:G Protein-Coupled Receptor (GPCR)
Mol. Mass.:52868.96
Organism:Homo sapiens (Human)
Description:P21554
Residue:472
BDBM50348122
NameBDBM50348122
Synonyms:CHEMBL1800168
TypeSmall organic molecule
Emp. Form.C17H24N2O2S
Mol. Mass.320.45
SMILESCCS(=O)(=O)c1ccc2n(CC3CC3)c(nc2c1)C(C)(C)C