Reaction Details
TargetCannabinoid receptor 2
LigandBDBM50348130
Substrate/Competitorn/a
Meas. Tech.ChEMBL_757135 (CHEMBL1803275)
EC50 11±n/a nM
Citation Watson, COwen, DRHarding, DKon-I, KLewis, MLMason, HJMatsumizu, MMukaiyama, TRodriguez-Lens, MShima, ATakeuchi, MTran, IYoung, T Optimisation of a novel series of selective CNS penetrant CB(2) agonists. Bioorg Med Chem Lett21:4284-7 (2011) 
 
Cannabinoid receptor 2
Name:Cannabinoid receptor 2
Type:G Protein-Coupled Receptor (GPCR)
Mol. Mass.:39690.94
Organism:Homo sapiens (Human)
Description:P34972
Residue:360
BDBM50348130
NameBDBM50348130
Synonyms:CHEMBL1800177
TypeSmall organic molecule
Emp. Form.C18H26N2O3S
Mol. Mass.350.476
SMILESCCS(=O)(=O)c1ccc2n(C[C@@H]3CCCO3)c(nc2c1)C(C)(C)C