Reaction Details
TargetCannabinoid receptor 1
LigandBDBM50348136
Substrate/Competitorn/a
Meas. Tech.ChEMBL_757147 (CHEMBL1803287)
Ki 2000±n/a nM
Citation Martín-Couce, LMartín-Fontecha, MCapolicchio, SLópez-Rodríguez, MLOrtega-Gutiérrez, S Development of endocannabinoid-based chemical probes for the study of cannabinoid receptors. J Med Chem54:5265-9 (2011) 
 
Cannabinoid receptor 1
Name:Cannabinoid receptor 1
Type:G Protein-Coupled Receptor (GPCR)
Mol. Mass.:52868.96
Organism:Homo sapiens (Human)
Description:P21554
Residue:472
BDBM50348136
NameBDBM50348136
Synonyms:CHEMBL1800182
TypeSmall organic molecule
Emp. Form.C38H62N4O6S
Mol. Mass.702.987
SMILESC[C@H](CO)NC(=O)CCC\C=C/C\C=C/C\C=C/C\C=C/CCCCOC(=O)CCCCCNC(=O)CCCC[C@@H]1SC[C@@H]2NC(=O)N[C@H]12