Reaction Details
TargetCannabinoid receptor 2
LigandBDBM50348135
Substrate/Competitorn/a
Meas. Tech.ChEMBL_757148 (CHEMBL1803288)
Ki>2000±n/a nM
Citation Martín-Couce, LMartín-Fontecha, MCapolicchio, SLópez-Rodríguez, MLOrtega-Gutiérrez, S Development of endocannabinoid-based chemical probes for the study of cannabinoid receptors. J Med Chem54:5265-9 (2011) 
 
Cannabinoid receptor 2
Name:Cannabinoid receptor 2
Type:G Protein-Coupled Receptor (GPCR)
Mol. Mass.:39690.94
Organism:Homo sapiens (Human)
Description:P34972
Residue:360
BDBM50348135
NameBDBM50348135
Synonyms:CHEMBL1800181
TypeSmall organic molecule
Emp. Form.C38H60N4O5S
Mol. Mass.684.972
SMILESO=C(CCCC[C@@H]1SC[C@@H]2NC(=O)N[C@H]12)NCCCCCC(=O)OCCCC\C=C/C\C=C/C\C=C/C\C=C/CCCC(=O)NC1CC1