Reaction Details
TargetCannabinoid receptor 2
LigandBDBM50348139
Substrate/Competitorn/a
Meas. Tech.ChEMBL_757148 (CHEMBL1803288)
Ki>2000±n/a nM
Citation Martín-Couce, LMartín-Fontecha, MCapolicchio, SLópez-Rodríguez, MLOrtega-Gutiérrez, S Development of endocannabinoid-based chemical probes for the study of cannabinoid receptors. J Med Chem54:5265-9 (2011) 
 
Cannabinoid receptor 2
Name:Cannabinoid receptor 2
Type:G Protein-Coupled Receptor (GPCR)
Mol. Mass.:39690.94
Organism:Homo sapiens (Human)
Description:P34972
Residue:360
BDBM50348139
NameBDBM50348139
Synonyms:CHEMBL1800729
TypeSmall organic molecule
Emp. Form.C45H58N2O5
Mol. Mass.706.9524
SMILESCCCCC\C=C/C\C=C/C\C=C/C\C=C/CCCC(=O)N[C@H](C)COC(=O)[C@H](Cc1ccc(cc1)C(=O)c1ccccc1)NC(=O)CCCC#C