Reaction Details
TargetAdenosine receptor A3
LigandBDBM50348152
Substrate/Competitorn/a
Meas. Tech.ChEMBL_757185 (CHEMBL1803409)
Ki 2.36±n/a nM
Citation Baraldi, PGPreti, DZaid, ANSaponaro, GTabrizi, MABaraldi, SRomagnoli, RMoorman, ARVarani, KCosconati, SDi Maro, SMarinelli, LNovellino, EBorea, PA New 2-heterocyclyl-imidazo[2,1-i]purin-5-one derivatives as potent and selective human A3 adenosine receptor antagonists. J Med Chem54:5205-20 (2011) 
 
Adenosine receptor A3
Name:Adenosine receptor A3
Type:G Protein-Coupled Receptor (GPCR)
Mol. Mass.:36197.32
Organism:Homo sapiens (Human)
Description:P0DMS8
Residue:318
BDBM50348152
NameBDBM50348152
Synonyms:CHEMBL1800781
TypeSmall organic molecule
Emp. Form.C16H19N7O2
Mol. Mass.341.3678
SMILESCOc1cc(-c2nc3c4NC(C)Cn4c(=O)n(CC=C)c3n2)n(C)n1