Reaction Details
TargetAdenosine receptor A3
LigandBDBM50348154
Substrate/Competitorn/a
Meas. Tech.ChEMBL_757185 (CHEMBL1803409)
Ki 1.46±n/a nM
Citation Baraldi, PGPreti, DZaid, ANSaponaro, GTabrizi, MABaraldi, SRomagnoli, RMoorman, ARVarani, KCosconati, SDi Maro, SMarinelli, LNovellino, EBorea, PA New 2-heterocyclyl-imidazo[2,1-i]purin-5-one derivatives as potent and selective human A3 adenosine receptor antagonists. J Med Chem54:5205-20 (2011) 
 
Adenosine receptor A3
Name:Adenosine receptor A3
Type:G Protein-Coupled Receptor (GPCR)
Mol. Mass.:36197.32
Organism:Homo sapiens (Human)
Description:P0DMS8
Residue:318
BDBM50348154
NameBDBM50348154
Synonyms:CHEMBL1800783
TypeSmall organic molecule
Emp. Form.C17H21N7O2
Mol. Mass.355.3943
SMILESCC[C@@H]1Cn2c(N1)c1nc(nc1n(CC=C)c2=O)-c1cc(OC)nn1C