Reaction Details
TargetAdenosine receptor A3
LigandBDBM50348165
Substrate/Competitorn/a
Meas. Tech.ChEMBL_757185 (CHEMBL1803409)
Ki 2.71±n/a nM
Citation Baraldi, PGPreti, DZaid, ANSaponaro, GTabrizi, MABaraldi, SRomagnoli, RMoorman, ARVarani, KCosconati, SDi Maro, SMarinelli, LNovellino, EBorea, PA New 2-heterocyclyl-imidazo[2,1-i]purin-5-one derivatives as potent and selective human A3 adenosine receptor antagonists. J Med Chem54:5205-20 (2011) 
 
Adenosine receptor A3
Name:Adenosine receptor A3
Type:G Protein-Coupled Receptor (GPCR)
Mol. Mass.:36197.32
Organism:Homo sapiens (Human)
Description:P0DMS8
Residue:318
BDBM50348165
NameBDBM50348165
Synonyms:CHEMBL1800864
TypeSmall organic molecule
Emp. Form.C20H20N6O3
Mol. Mass.392.4112
SMILESCCC1CN2C(=N1)c1[nH]c(nc1N(Cc1ccccc1)C2=O)-c1cc(OC)no1