Reaction Details
TargetHistone deacetylase 4
LigandBDBM50348379
Substrate/Competitorn/a
Meas. Tech.ChEMBL_757636 (CHEMBL1804893)
IC50>100000±n/a nM
Citation Kemp, MMWang, QFuller, JHWest, NMartinez, NMMorse, EMWeïwer, MSchreiber, SLBradner, JEKoehler, AN A novel HDAC inhibitor with a hydroxy-pyrimidine scaffold. Bioorg Med Chem Lett21:4164-9 (2011) 
 
Histone deacetylase 4
Name:Histone deacetylase 4
Type:Enzyme
Mol. Mass.:119049.39
Organism:Homo sapiens (Human)
Description:P56524
Residue:1084
BDBM50348379
NameBDBM50348379
Synonyms:CHEMBL1800378
TypeSmall organic molecule
Emp. Form.C15H13N3O3S
Mol. Mass.315.347
SMILESCc1cc(=O)[nH]c(SCC(=O)c2ccc3CC(=O)Nc3c2)n1