Reaction Details
TargetHistone deacetylase 1
LigandBDBM50348388
Substrate/Competitorn/a
Meas. Tech.ChEMBL_757633 (CHEMBL1804890)
IC50 16400±n/a nM
Citation Kemp, MMWang, QFuller, JHWest, NMartinez, NMMorse, EMWeïwer, MSchreiber, SLBradner, JEKoehler, AN A novel HDAC inhibitor with a hydroxy-pyrimidine scaffold. Bioorg Med Chem Lett21:4164-9 (2011) 
 
Histone deacetylase 1
Name:Histone deacetylase 1
Type:Enzyme
Mol. Mass.:55090.27
Organism:Homo sapiens (Human)
Description:Q13547
Residue:482
BDBM50348388
NameBDBM50348388
Synonyms:CHEMBL1800241
TypeSmall organic molecule
Emp. Form.C15H15N3O3S
Mol. Mass.317.363
SMILESCC(=O)Nc1ccc(cc1)C(=O)CSc1nc(C)cc(=O)[nH]1