Reaction Details
TargetHistone deacetylase 1
LigandBDBM50348384
Substrate/Competitorn/a
Meas. Tech.ChEMBL_757633 (CHEMBL1804890)
IC50 77200±n/a nM
Citation Kemp, MMWang, QFuller, JHWest, NMartinez, NMMorse, EMWeïwer, MSchreiber, SLBradner, JEKoehler, AN A novel HDAC inhibitor with a hydroxy-pyrimidine scaffold. Bioorg Med Chem Lett21:4164-9 (2011) 
 
Histone deacetylase 1
Name:Histone deacetylase 1
Type:Enzyme
Mol. Mass.:55090.27
Organism:Homo sapiens (Human)
Description:Q13547
Residue:482
BDBM50348384
NameBDBM50348384
Synonyms:CHEMBL1800383
TypeSmall organic molecule
Emp. Form.C11H14N2O4S
Mol. Mass.270.305
SMILESCCOC(=O)CC(=O)CSc1nc(C)cc(=O)[nH]1