Reaction Details
TargetHistone deacetylase 2
LigandBDBM50348376
Substrate/Competitorn/a
Meas. Tech.ChEMBL_757634 (CHEMBL1804891)
IC50 67000±n/a nM
Citation Kemp, MMWang, QFuller, JHWest, NMartinez, NMMorse, EMWeïwer, MSchreiber, SLBradner, JEKoehler, AN A novel HDAC inhibitor with a hydroxy-pyrimidine scaffold. Bioorg Med Chem Lett21:4164-9 (2011) 
 
Histone deacetylase 2
Name:Histone deacetylase 2
Type:Chromatin regulator; hydrolase; repressor
Mol. Mass.:55356.54
Organism:Homo sapiens (Human)
Description:Q92769
Residue:488
BDBM50348376
NameBDBM50348376
Synonyms:CHEMBL1800375
TypeSmall organic molecule
Emp. Form.C13H11ClN2O2S
Mol. Mass.294.757
SMILESCc1cc(=O)[nH]c(SCC(=O)c2ccc(Cl)cc2)n1