Reaction Details
TargetHistone deacetylase 3
LigandBDBM50348376
Substrate/Competitorn/a
Meas. Tech.ChEMBL_757635 (CHEMBL1804892)
IC50 86400±n/a nM
Citation Kemp, MMWang, QFuller, JHWest, NMartinez, NMMorse, EMWeïwer, MSchreiber, SLBradner, JEKoehler, AN A novel HDAC inhibitor with a hydroxy-pyrimidine scaffold. Bioorg Med Chem Lett21:4164-9 (2011) 
 
Histone deacetylase 3
Name:Histone deacetylase 3
Type:Enzyme
Mol. Mass.:48829.55
Organism:Homo sapiens (Human)
Description:O15379
Residue:428
BDBM50348376
NameBDBM50348376
Synonyms:CHEMBL1800375
TypeSmall organic molecule
Emp. Form.C13H11ClN2O2S
Mol. Mass.294.757
SMILESCc1cc(=O)[nH]c(SCC(=O)c2ccc(Cl)cc2)n1