Reaction Details
TargetBeta-2 adrenergic receptor
LigandBDBM25771
Substrate/Competitorn/a
Meas. Tech.ChEMBL_755360 (CHEMBL1804516)
Ki 1.5±n/a nM
Citation Jozwiak, KWoo, AYTanga, MJToll, LJimenez, LKozocas, JAPlazinska, AXiao, RPWainer, IW Comparative molecular field analysis of fenoterol derivatives: A platform towards highly selective and effective beta(2)-adrenergic receptor agonists. Bioorg Med Chem18:728-36 (2010) 
 
Beta-2 adrenergic receptor
Name:Beta-2 adrenergic receptor
Type:n/a
Mol. Mass.:46461.69
Organism:Homo sapiens (Human)
Description:P07550
Residue:413
BDBM25771
NameBDBM25771
Synonyms:1-hydroxy-2-naphthoic acid;4-[1-hydroxy-2-[6-(4-phenylbutoxy)hexylamino]ethyl]-2-methylol-phenol Aeromax Serevent | salmeterol xinafoate
TypeSmall organic molecule
Emp. Form.C25H37NO4
Mol. Mass.415.5656
SMILESOCc1cc(ccc1O)C(O)CNCCCCCCOCCCCc1ccccc1