Reaction Details
TargetBeta-2 adrenergic receptor
LigandBDBM50348428
Substrate/Competitorn/a
Meas. Tech.ChEMBL_755357 (CHEMBL1804513)
EC50 133±n/a nM
Citation Jozwiak, KWoo, AYTanga, MJToll, LJimenez, LKozocas, JAPlazinska, AXiao, RPWainer, IW Comparative molecular field analysis of fenoterol derivatives: A platform towards highly selective and effective beta(2)-adrenergic receptor agonists. Bioorg Med Chem18:728-36 (2010) 
 
Beta-2 adrenergic receptor
Name:Beta-2 adrenergic receptor
Type:PROTEIN
Mol. Mass.:46896.26
Organism:Rattus norvegicus
Description:ChEMBL_38603
Residue:418
BDBM50348428
NameBDBM50348428
Synonyms:CHEMBL1800961 | US9492405, 40
TypeSmall organic molecule
Emp. Form.C21H23NO3
Mol. Mass.337.4122
SMILESC[C@H](Cc1ccc2ccccc2c1)NC[C@H](O)c1cc(O)cc(O)c1