Reaction Details
TargetBeta-1 adrenergic receptor
LigandBDBM25771
Substrate/Competitorn/a
Meas. Tech.ChEMBL_755361 (CHEMBL1804517)
Ki 2300±n/a nM
Citation Jozwiak, KWoo, AYTanga, MJToll, LJimenez, LKozocas, JAPlazinska, AXiao, RPWainer, IW Comparative molecular field analysis of fenoterol derivatives: A platform towards highly selective and effective beta(2)-adrenergic receptor agonists. Bioorg Med Chem18:728-36 (2010) 
 
Beta-1 adrenergic receptor
Name:Beta-1 adrenergic receptor
Type:G Protein-Coupled Receptor (GPCR)
Mol. Mass.:51338.40
Organism:Homo sapiens (Human)
Description:P08588
Residue:477
BDBM25771
NameBDBM25771
Synonyms:1-hydroxy-2-naphthoic acid;4-[1-hydroxy-2-[6-(4-phenylbutoxy)hexylamino]ethyl]-2-methylol-phenol Aeromax Serevent | salmeterol xinafoate
TypeSmall organic molecule
Emp. Form.C25H37NO4
Mol. Mass.415.5656
SMILESOCc1cc(ccc1O)C(O)CNCCCCCCOCCCCc1ccccc1