Reaction Details
TargetVoltage-dependent calcium channel subunit alpha-2/delta-1
LigandBDBM50348475
Substrate/Competitorn/a
Meas. Tech.ChEMBL_754894 (CHEMBL1805878)
IC50 25±n/a nM
Citation Myatt, JWHealy, MPBravi, GSBillinton, AJohnson, CNMatthews, KLJandu, KSMeng, WHersey, ALivermore, DGDouault, CBWitherington, JBit, RARowedder, JEBrown, JDClayton, NM Pyrazolopyridazine alpha-2-delta-1 ligands for the treatment of neuropathic pain. Bioorg Med Chem Lett20:4683-8 (2010) 
 
Voltage-dependent calcium channel subunit alpha-2/delta-1
Name:Voltage-dependent calcium channel subunit alpha-2/delta-1
Type:Enzyme
Mol. Mass.:124544.88
Organism:Homo sapiens (Human)
Description:P54289
Residue:1103
BDBM50348475
NameBDBM50348475
Synonyms:CHEMBL1801187
TypeSmall organic molecule
Emp. Form.C19H21F2N5O
Mol. Mass.373.3997
SMILESCCOc1ccc(cc1)-n1nc2c(nnc(C)c2c1C)N1CCC(F)(F)C1