Reaction Details
TargetVoltage-dependent calcium channel subunit alpha-2/delta-2
LigandBDBM50348470
Substrate/Competitorn/a
Meas. Tech.ChEMBL_754900 (CHEMBL1805884)
IC50 398±n/a nM
Citation Myatt, JWHealy, MPBravi, GSBillinton, AJohnson, CNMatthews, KLJandu, KSMeng, WHersey, ALivermore, DGDouault, CBWitherington, JBit, RARowedder, JEBrown, JDClayton, NM Pyrazolopyridazine alpha-2-delta-1 ligands for the treatment of neuropathic pain. Bioorg Med Chem Lett20:4683-8 (2010) 
 
Voltage-dependent calcium channel subunit alpha-2/delta-2
Name:Voltage-dependent calcium channel subunit alpha-2/delta-2
Type:PROTEIN
Mol. Mass.:129803.50
Organism:Homo sapiens (Human)
Description:ChEMBL_754900
Residue:1150
BDBM50348470
NameBDBM50348470
Synonyms:CHEMBL1801182
TypeSmall organic molecule
Emp. Form.C19H20F3N5O
Mol. Mass.391.3902
SMILESCc1n(nc2c(nnc(C)c12)N1CCCC1)-c1ccc(OCC(F)(F)F)cc1