Reaction Details
TargetVoltage-dependent calcium channel subunit alpha-2/delta-2
LigandBDBM50348478
Substrate/Competitorn/a
Meas. Tech.ChEMBL_754900 (CHEMBL1805884)
IC50 158±n/a nM
Citation Myatt, JWHealy, MPBravi, GSBillinton, AJohnson, CNMatthews, KLJandu, KSMeng, WHersey, ALivermore, DGDouault, CBWitherington, JBit, RARowedder, JEBrown, JDClayton, NM Pyrazolopyridazine alpha-2-delta-1 ligands for the treatment of neuropathic pain. Bioorg Med Chem Lett20:4683-8 (2010) 
 
Voltage-dependent calcium channel subunit alpha-2/delta-2
Name:Voltage-dependent calcium channel subunit alpha-2/delta-2
Type:PROTEIN
Mol. Mass.:129803.50
Organism:Homo sapiens (Human)
Description:ChEMBL_754900
Residue:1150
BDBM50348478
NameBDBM50348478
Synonyms:CHEMBL1801205
TypeSmall organic molecule
Emp. Form.C17H21N5O
Mol. Mass.311.3815
SMILESCCOc1ccc(cc1)-n1nc2c(nnc(C)c2c1C)N(C)C