Reaction Details
TargetMAP kinase-activated protein kinase 2
LigandBDBM50348500
Substrate/Competitorn/a
Meas. Tech.ChEMBL_754901 (CHEMBL1805885)
IC50 45±n/a nM
Citation Revesz, LSchlapbach, AAichholz, RDawson, JFeifel, RHawtin, SLittlewood-Evans, AKoch, GKroemer, MMöbitz, HScheufler, CVelcicky, JHuppertz, C In vivo and in vitro SAR of tetracyclic MAPKAP-K2 (MK2) inhibitors. Part II. Bioorg Med Chem Lett20:4719-23 (2010) 
 
MAP kinase-activated protein kinase 2
Name:MAP kinase-activated protein kinase 2
Type:Serine/threonine-protein kinase
Mol. Mass.:45579.87
Organism:Homo sapiens (Human)
Description:P49137
Residue:400
BDBM50348500
NameBDBM50348500
Synonyms:CHEMBL1801295
TypeSmall organic molecule
Emp. Form.C24H24N4O2
Mol. Mass.400.473
SMILESCOc1ccc(cc1)-c1cc2-c3[nH]c4CC5(CN(C)C5)NC(=O)c4c3CCc2cn1