Reaction Details
TargetMAP kinase-activated protein kinase 2
LigandBDBM50348501
Substrate/Competitorn/a
Meas. Tech.ChEMBL_754901 (CHEMBL1805885)
IC50 50±n/a nM
Citation Revesz, LSchlapbach, AAichholz, RDawson, JFeifel, RHawtin, SLittlewood-Evans, AKoch, GKroemer, MMöbitz, HScheufler, CVelcicky, JHuppertz, C In vivo and in vitro SAR of tetracyclic MAPKAP-K2 (MK2) inhibitors. Part II. Bioorg Med Chem Lett20:4719-23 (2010) 
 
MAP kinase-activated protein kinase 2
Name:MAP kinase-activated protein kinase 2
Type:Serine/threonine-protein kinase
Mol. Mass.:45579.87
Organism:Homo sapiens (Human)
Description:P49137
Residue:400
BDBM50348501
NameBDBM50348501
Synonyms:CHEMBL1801279
TypeSmall organic molecule
Emp. Form.C21H17FN4O
Mol. Mass.360.3843
SMILESFc1ccc(cn1)-c1cc2-c3[nH]c4CC5(CC5)NC(=O)c4c3CCc2cn1