Reaction Details
TargetMAP kinase-activated protein kinase 2
LigandBDBM50348506
Substrate/Competitorn/a
Meas. Tech.ChEMBL_754901 (CHEMBL1805885)
IC50 130±n/a nM
Citation Revesz, LSchlapbach, AAichholz, RDawson, JFeifel, RHawtin, SLittlewood-Evans, AKoch, GKroemer, MMöbitz, HScheufler, CVelcicky, JHuppertz, C In vivo and in vitro SAR of tetracyclic MAPKAP-K2 (MK2) inhibitors. Part II. Bioorg Med Chem Lett20:4719-23 (2010) 
 
MAP kinase-activated protein kinase 2
Name:MAP kinase-activated protein kinase 2
Type:Serine/threonine-protein kinase
Mol. Mass.:45579.87
Organism:Homo sapiens (Human)
Description:P49137
Residue:400
BDBM50348506
NameBDBM50348506
Synonyms:CHEMBL1801282
TypeSmall organic molecule
Emp. Form.C23H21N3O2
Mol. Mass.371.4317
SMILESCOc1ccc(cc1)-c1cc2-c3[nH]c4c(c3CCc2cn1)C(=O)NCC41CC1