Reaction Details
TargetMitogen-activated protein kinase 9
LigandBDBM50348534
Substrate/Competitorn/a
Meas. Tech.ChEMBL_755002 (CHEMBL1805904)
IC50 2±n/a nM
Citation Revesz, LSchlapbach, AAichholz, RFeifel, RHawtin, SHeng, RHiestand, PJahnke, WKoch, GKroemer, MMöbitz, HScheufler, CVelcicky, JHuppertz, C In vivo and in vitro SAR of tetracyclic MAPKAP-K2 (MK2) inhibitors. Part I. Bioorg Med Chem Lett20:4715-8 (2010) 
 
Mitogen-activated protein kinase 9
Name:Mitogen-activated protein kinase 9
Type:Enzyme
Mol. Mass.:48131.49
Organism:Homo sapiens (Human)
Description:JNK-2 was purchased from Upstate Cell Signaling Solutions (formerly Upstate Biotechnology).
Residue:424
BDBM50348534
NameBDBM50348534
Synonyms:CHEMBL1801373
TypeSmall organic molecule
Emp. Form.C21H15N3O
Mol. Mass.325.3633
SMILESO=C1NCc2[nH]c3c(ccc4cnc(\C=C\c5ccccc5)cc34)c12