Reaction Details
TargetMelanocortin receptor 4
LigandBDBM50348580
Substrate/Competitorn/a
Meas. Tech.ChEMBL_755005 (CHEMBL1805907)
IC50 0.890000±n/a nM
Citation He, SYe, ZDobbelaar, PHSebhat, IKGuo, LLiu, JJian, TLai, YFranklin, CLBakshi, RKDellureficio, JPHong, QWeinberg, DHMacneil, TTang, RStrack, AMTamvakopoulos, CPeng, QMiller, RRStearns, RAChen, HYChen, ASFong, TMWyvratt, MJNargund, RP Spiroindane based amides as potent and selective MC4R agonists for the treatment of obesity. Bioorg Med Chem Lett20:4399-405 (2010) 
 
Melanocortin receptor 4
Name:Melanocortin receptor 4
Type:Enzyme
Mol. Mass.:36949.50
Organism:Homo sapiens (Human)
Description:P32245
Residue:332
BDBM50348580
NameBDBM50348580
Synonyms:CHEMBL1801216
TypeSmall organic molecule
Emp. Form.C37H48ClF2N3O3
Mol. Mass.656.245
SMILESCc1cc2[C@H](CC3(CCN(CC3)C(=O)[C@@H]3CN(C[C@H]3c3ccc(F)cc3F)C(C)(C)C)c2cc1Cl)C(C)(C)C(=O)N1CC[C@H](O)C1