Reaction Details
TargetNeuropeptide S receptor
LigandBDBM50348586
Substrate/Competitorn/a
Meas. Tech.ChEMBL_755375 (CHEMBL1804531)
IC50 380±n/a nM
Citation Trotter, BWNanda, KKManley, PJUebele, VNCondra, CLGotter, ALMenzel, KHenault, MStocco, RRenger, JJHartman, GDBilodeau, MT Tricyclic imidazole antagonists of the Neuropeptide S Receptor. Bioorg Med Chem Lett20:4704-8 (2010) 
 
Neuropeptide S receptor
Name:Neuropeptide S receptor
Type:PROTEIN
Mol. Mass.:42692.30
Organism:Homo sapiens (Human)
Description:ChEMBL_1276607
Residue:371
BDBM50348586
NameBDBM50348586
Synonyms:CHEMBL1801267
TypeSmall organic molecule
Emp. Form.C23H17BrN2
Mol. Mass.401.298
SMILESBrc1ccc(cc1)C1(Cc2ccccc2)c2ccccc2-c2nccn12