Reaction Details
TargetNeuropeptide S receptor
LigandBDBM50348587
Substrate/Competitorn/a
Meas. Tech.ChEMBL_755375 (CHEMBL1804531)
IC50 369±n/a nM
Citation Trotter, BWNanda, KKManley, PJUebele, VNCondra, CLGotter, ALMenzel, KHenault, MStocco, RRenger, JJHartman, GDBilodeau, MT Tricyclic imidazole antagonists of the Neuropeptide S Receptor. Bioorg Med Chem Lett20:4704-8 (2010) 
 
Neuropeptide S receptor
Name:Neuropeptide S receptor
Type:PROTEIN
Mol. Mass.:42692.30
Organism:Homo sapiens (Human)
Description:ChEMBL_1276607
Residue:371
BDBM50348587
NameBDBM50348587
Synonyms:CHEMBL1801268
TypeSmall organic molecule
Emp. Form.C24H16BrN3
Mol. Mass.426.308
SMILESBrc1ccc(cc1)C1(Cc2ccccc2C#N)c2ccccc2-c2nccn12