Reaction Details
TargetNeuropeptide S receptor
LigandBDBM50348606
Substrate/Competitorn/a
Meas. Tech.ChEMBL_755375 (CHEMBL1804531)
IC50 114±n/a nM
Citation Trotter, BWNanda, KKManley, PJUebele, VNCondra, CLGotter, ALMenzel, KHenault, MStocco, RRenger, JJHartman, GDBilodeau, MT Tricyclic imidazole antagonists of the Neuropeptide S Receptor. Bioorg Med Chem Lett20:4704-8 (2010) 
 
Neuropeptide S receptor
Name:Neuropeptide S receptor
Type:PROTEIN
Mol. Mass.:42692.30
Organism:Homo sapiens (Human)
Description:ChEMBL_1276607
Residue:371
BDBM50348606
NameBDBM50348606
Synonyms:CHEMBL1801330
TypeSmall organic molecule
Emp. Form.C24H23N3
Mol. Mass.353.4595
SMILESN#Cc1ccc(cc1)C1(CC2CCCCC2)c2ccccc2-c2nccn12