Reaction Details
TargetNeuropeptide S receptor
LigandBDBM50348607
Substrate/Competitorn/a
Meas. Tech.ChEMBL_755375 (CHEMBL1804531)
IC50 131±n/a nM
Citation Trotter, BWNanda, KKManley, PJUebele, VNCondra, CLGotter, ALMenzel, KHenault, MStocco, RRenger, JJHartman, GDBilodeau, MT Tricyclic imidazole antagonists of the Neuropeptide S Receptor. Bioorg Med Chem Lett20:4704-8 (2010) 
 
Neuropeptide S receptor
Name:Neuropeptide S receptor
Type:PROTEIN
Mol. Mass.:42692.30
Organism:Homo sapiens (Human)
Description:ChEMBL_1276607
Residue:371
BDBM50348607
NameBDBM50348607
Synonyms:CHEMBL1801331
TypeSmall organic molecule
Emp. Form.C26H28ClN3O
Mol. Mass.433.973
SMILESCCC1CCCCN1C(=O)CCC1(c2ccccc2-c2nccn12)c1ccc(Cl)cc1