Reaction Details
TargetNeuropeptide S receptor
LigandBDBM50348609
Substrate/Competitorn/a
Meas. Tech.ChEMBL_755375 (CHEMBL1804531)
IC50 138±n/a nM
Citation Trotter, BWNanda, KKManley, PJUebele, VNCondra, CLGotter, ALMenzel, KHenault, MStocco, RRenger, JJHartman, GDBilodeau, MT Tricyclic imidazole antagonists of the Neuropeptide S Receptor. Bioorg Med Chem Lett20:4704-8 (2010) 
 
Neuropeptide S receptor
Name:Neuropeptide S receptor
Type:PROTEIN
Mol. Mass.:42692.30
Organism:Homo sapiens (Human)
Description:ChEMBL_1276607
Residue:371
BDBM50348609
NameBDBM50348609
Synonyms:CHEMBL1801334
TypeSmall organic molecule
Emp. Form.C24H26ClN3O
Mol. Mass.407.936
SMILESCCN(C(C)C)C(=O)CCC1(c2ccccc2-c2nccn12)c1ccc(Cl)cc1