Reaction Details
TargetThromboxane A2 receptor
LigandBDBM50348614
Substrate/Competitorn/a
Meas. Tech.ChEMBL_755468 (CHEMBL1804937)
IC50 7000±n/a nM
Citation Trotter, BWNanda, KKManley, PJUebele, VNCondra, CLGotter, ALMenzel, KHenault, MStocco, RRenger, JJHartman, GDBilodeau, MT Tricyclic imidazole antagonists of the Neuropeptide S Receptor. Bioorg Med Chem Lett20:4704-8 (2010) 
 
Thromboxane A2 receptor
Name:Thromboxane A2 receptor
Type:Enyzme
Mol. Mass.:37445.28
Organism:Homo sapiens (Human)
Description:P21731
Residue:343
BDBM50348614
NameBDBM50348614
Synonyms:CHEMBL1801358
TypeSmall organic molecule
Emp. Form.C23H23ClN2O2
Mol. Mass.394.894
SMILESCOc1ccc-2c(c1)C(CC1CCOCC1)(c1ccc(Cl)cc1)n1ccnc-21