Reaction Details
TargetRho-associated protein kinase 2
LigandBDBM50348621
Substrate/Competitorn/a
Meas. Tech.ChEMBL_755624 (CHEMBL1805364)
IC50>10000±n/a nM
Citation Belanger, DBCurran, PJHruza, AVoigt, JMeng, ZMandal, AKSiddiqui, MABasso, ADGray, K Discovery of imidazo[1,2-a]pyrazine-based Aurora kinase inhibitors. Bioorg Med Chem Lett20:5170-4 (2010) 
 
Rho-associated protein kinase 2
Name:Rho-associated protein kinase 2
Type:Protein
Mol. Mass.:160885.43
Organism:Homo sapiens (Human)
Description:O75116
Residue:1388
BDBM50348621
NameBDBM50348621
Synonyms:CHEMBL1270795
TypeSmall organic molecule
Emp. Form.C14H13N7S2
Mol. Mass.343.43
SMILESCSc1cn2c(cnc2c(Nc2cc(C)ns2)n1)-c1cn[nH]c1