Reaction Details
TargetCyclin-dependent kinase 2
LigandBDBM50348621
Substrate/Competitorn/a
Meas. Tech.ChEMBL_755601 (CHEMBL1805341)
IC50 2273±n/a nM
Citation Belanger, DBCurran, PJHruza, AVoigt, JMeng, ZMandal, AKSiddiqui, MABasso, ADGray, K Discovery of imidazo[1,2-a]pyrazine-based Aurora kinase inhibitors. Bioorg Med Chem Lett20:5170-4 (2010) 
 
Cyclin-dependent kinase 2
Name:Cyclin-dependent kinase 2
Type:Enzyme Subunit
Mol. Mass.:33938.17
Organism:Homo sapiens (Human)
Description:P24941
Residue:298
BDBM50348621
NameBDBM50348621
Synonyms:CHEMBL1270795
TypeSmall organic molecule
Emp. Form.C14H13N7S2
Mol. Mass.343.43
SMILESCSc1cn2c(cnc2c(Nc2cc(C)ns2)n1)-c1cn[nH]c1