Reaction Details
TargetMitogen-activated protein kinase 1
LigandBDBM50348621
Substrate/Competitorn/a
Meas. Tech.ChEMBL_755596 (CHEMBL1805336)
IC50>10000±n/a nM
Citation Belanger, DBCurran, PJHruza, AVoigt, JMeng, ZMandal, AKSiddiqui, MABasso, ADGray, K Discovery of imidazo[1,2-a]pyrazine-based Aurora kinase inhibitors. Bioorg Med Chem Lett20:5170-4 (2010) 
 
Mitogen-activated protein kinase 1
Name:Mitogen-activated protein kinase 1
Type:Ser/Thr Protein Kinase
Mol. Mass.:41392.76
Organism:Homo sapiens (Human)
Description:P28482
Residue:360
BDBM50348621
NameBDBM50348621
Synonyms:CHEMBL1270795
TypeSmall organic molecule
Emp. Form.C14H13N7S2
Mol. Mass.343.43
SMILESCSc1cn2c(cnc2c(Nc2cc(C)ns2)n1)-c1cn[nH]c1