Reaction Details
TargetHepatocyte growth factor receptor
LigandBDBM50348621
Substrate/Competitorn/a
Meas. Tech.ChEMBL_755620 (CHEMBL1805360)
IC50>10000±n/a nM
Citation Belanger, DBCurran, PJHruza, AVoigt, JMeng, ZMandal, AKSiddiqui, MABasso, ADGray, K Discovery of imidazo[1,2-a]pyrazine-based Aurora kinase inhibitors. Bioorg Med Chem Lett20:5170-4 (2010) 
 
Hepatocyte growth factor receptor
Name:Hepatocyte growth factor receptor
Type:Protein
Mol. Mass.:155559.73
Organism:Homo sapiens (Human)
Description:P08581
Residue:1390
BDBM50348621
NameBDBM50348621
Synonyms:CHEMBL1270795
TypeSmall organic molecule
Emp. Form.C14H13N7S2
Mol. Mass.343.43
SMILESCSc1cn2c(cnc2c(Nc2cc(C)ns2)n1)-c1cn[nH]c1