Reaction Details
TargetAurora kinase A
LigandBDBM50348622
Substrate/Competitorn/a
Meas. Tech.ChEMBL_755594 (CHEMBL1805334)
IC50 570±n/a nM
Citation Belanger, DBCurran, PJHruza, AVoigt, JMeng, ZMandal, AKSiddiqui, MABasso, ADGray, K Discovery of imidazo[1,2-a]pyrazine-based Aurora kinase inhibitors. Bioorg Med Chem Lett20:5170-4 (2010) 
 
Aurora kinase A
Name:Aurora kinase A
Type:Serine/threonine-protein kinase
Mol. Mass.:45830.98
Organism:Homo sapiens (Human)
Description:O14965
Residue:403
BDBM50348622
NameBDBM50348622
Synonyms:CHEMBL1801100
TypeSmall organic molecule
Emp. Form.C14H13N7S
Mol. Mass.311.365
SMILESCc1cc(Nc2nccn3c(cnc23)-c2cnn(C)c2)sn1