Reaction Details
TargetAurora kinase A
LigandBDBM50348642
Substrate/Competitorn/a
Meas. Tech.ChEMBL_755594 (CHEMBL1805334)
IC50 82±n/a nM
Citation Belanger, DBCurran, PJHruza, AVoigt, JMeng, ZMandal, AKSiddiqui, MABasso, ADGray, K Discovery of imidazo[1,2-a]pyrazine-based Aurora kinase inhibitors. Bioorg Med Chem Lett20:5170-4 (2010) 
 
Aurora kinase A
Name:Aurora kinase A
Type:Serine/threonine-protein kinase
Mol. Mass.:45830.98
Organism:Homo sapiens (Human)
Description:O14965
Residue:403
BDBM50348642
NameBDBM50348642
Synonyms:CHEMBL1801132
TypeSmall organic molecule
Emp. Form.C17H20N8S2
Mol. Mass.400.524
SMILESCN(C)CCSc1cn2c(cnc2c(Nc2cc(C)ns2)n1)-c1cn[nH]c1